{"text_format":"1","workbook":"xlsx","n_sheets":4,"sheets":["Différents taux","Etat de frais de déplacement","Frais de déplacement","Paramètres"],"not_rendered":{"charts":0,"images":4,"macros":1,"external_links":0,"defined_names":9,"comments":2,"pivot_tables":0},"unopened":[],"bounds":{"document_bytes":16777216,"sheet_cells":100000,"rows_first":2000,"rows_last":500,"rows_between":2000,"halvings":0,"cell_chars":16384,"cell_head_chars":4096},"cells_cut":0,"cells_raw":0,"read":"whole","date_system":"1900"}

{"sheet":"Différents taux","index":0,"n_rows":0,"n_cols":0,"rows_kept":0,"cut":false,"hidden":false,"merged":[]}

{"sheet":"Etat de frais de déplacement","index":1,"n_rows":41,"n_cols":25,"rows_kept":41,"cut":false,"hidden":false,"merged":[[3,14,3,15],[3,10,3,11],[7,7,7,8],[3,7,3,8],[4,7,4,8],[5,7,5,8],[4,17,5,17],[4,14,4,15],[4,5,4,6],[4,10,4,11],[4,12,4,13],[5,3,5,6],[5,14,5,15],[5,10,5,11],[6,21,7,21],[9,17,10,17],[9,15,9,16],[2,19,3,20],[9,19,10,19],[2,21,3,21],[2,15,2,16],[7,14,7,15],[9,21,9,24],[9,20,10,20],[2,10,2,14],[6,19,7,20],[6,14,6,15],[7,12,7,13],[3,16,3,17],[9,9,9,10],[27,3,27,4],[19,3,19,4],[6,3,6,6],[7,3,7,6],[6,12,6,13],[7,10,7,11],[6,10,6,11],[9,7,9,8],[6,7,6,8],[9,11,9,12],[2,0,7,0],[2,3,2,6],[18,3,18,4],[15,3,15,4],[34,15,35,16],[34,12,34,14],[35,12,35,14],[34,7,35,8],[32,0,32,8],[29,3,29,4],[20,3,20,4],[23,3,23,4],[13,3,13,4],[21,3,21,4],[14,3,14,4],[26,3,26,4],[0,1,0,17],[2,1,2,2],[3,1,3,2],[4,1,4,2],[22,3,22,4],[3,12,3,13],[9,13,9,14],[5,12,5,13],[11,3,11,4],[2,7,2,9],[6,1,6,2],[7,1,7,2],[9,5,9,6],[3,3,3,6],[4,3,4,4],[5,1,5,2],[38,2,38,3],[38,7,38,9],[38,4,38,6],[34,9,35,9],[34,3,35,5],[40,0,40,17],[32,9,32,17],[30,3,30,4],[16,3,16,4],[17,3,17,4],[24,3,24,4],[25,3,25,4],[34,2,35,2],[38,0,38,1],[36,15,36,16],[28,3,28,4],[38,10,38,11],[37,4,37,6],[37,0,37,3],[34,0,35,1],[37,7,37,10],[9,0,10,0],[9,1,10,1],[10,3,10,4],[9,2,9,4],[12,3,12,4]]}
[null,"Remplir l'état sous EXCEL en utilisant les cellules de couleur jaune clair. - Un formulaire complet et correctement renseigné sera traité d'autant plus rapidement.\nRéférences : NDS-19-PF-246 vB du 21/12/2019. Convention collective nationale 9200-19-DCC-GRH-001 applicable au 1/1/2019. Domaines fonctionnels actualisés 2021.\nAide à la saisie: lire les commentaires de cellule (signalés par un petit triangle rouge en haut à droite de la cellule) ->\nPour saisir un nouvel état, pour que soit mis à jour le suivi des km parcourus (cellule J6) et des repas indemnisés (cellule J8) et vider les lignes de détail, cliquer sur ->"]
["DT Auvergne-Rhône-Alpes"]
["DEMANDEUR","NOM Prénom :",null,null,null,null,null,"ORDRE DE MISSION ANNUEL",null,null,"AUTORISATION D'UTILISER LE VÉHICULE PERSONNEL",null,null,null,null,"Date de la décision :",null,null,null,"Si autorisation, nombre de km VP en instance :",null,{"$f":"SUM(N12:N31)","v":0}]
[null,"Catégorie de personnel :",null,"Agent de droit public",null,null,null,"Date de la décision :",null,null,"Nombre de kilomètres autorisés :",null,null,null,"Véhicule utilisé :"]
[null,"Résid. fam./admin. :",null,null,null,null,null,"Plafond de km :",null,null,"Tranche kilométrique :",null,"≤ 2 000 km",null,"de 2 001 à 10 000 km",null,"> 10 000 km","Totaux"]
[null,"Service :",null,null,null,null,null,"Km parcourus :",null,null,"Taux :",null,{"$f":"IF(ISERROR(VLOOKUP($Q$4,Paramètres!$A$5:$D$9,2,FALSE)),\"\",VLOOKUP($Q$4,Paramètres!$A$5:$D$9,2,FALSE))","v":""},null,{"$f":"IF(ISERROR(VLOOKUP($Q$4,Paramètres!$A$5:$D$9,3,FALSE)),\"\",VLOOKUP($Q$4,Paramètres!$A$5:$D$9,3,FALSE))","v":""},null,{"$f":"IF(ISERROR(VLOOKUP($Q$4,Paramètres!$A$5:$D$9,4,FALSE)),\"\",VLOOKUP($Q$4,Paramètres!$A$5:$D$9,4,FALSE))","v":""}]
[null,"Code fournisseur SAP :",null,null,null,null,null,"Plafond de repas :",null,null,"Kilomètres parcourus :",null,null,null,null,null,null,{"$f":"IF(SUM(M7:Q7)=0,\"\",SUM(M7:Q7))","v":""},null,"Si autorisation, nombre de repas en instance :",null,{"$f":"SUM(K12:K31)","v":0}]
[null,"Cpte bancaire (IBAN) :",null,null,null,null,null,"Repas indemnisés :",null,null,"Indemnité :",null,{"$f":"IF(ISERROR(M6*M7),\"\",M6*M7)","v":""},null,{"$f":"IF(ISERROR(O6*O7),\"\",O6*O7)","v":""},null,{"$f":"IF(ISERROR(Q6*Q7),\"\",Q6*Q7)","v":""},{"$f":"SUM(M8:Q8)","v":0}]
[]
["Domaine\nfonctionnel","OM A/P","Déplacement",null,null,"Départ",null,"Retour",null,"Repas",null,"Nuitées",null,"Frais de transport",null,"Autres frais",null,"Total",null,"Montant repas","Montant nuitées","Montant indemnité km"]
[null,null,"Motif","Trajet effectué",null,"Date","Heure","Date","Heure","Taux","Nb","Taux","Nb","Km en VP","Tarif SNCF","Nature","Montant",null,null,null,null,"≤ 2 000 km","≤ 10 0000","> 10 000 km","Total"]
[null,null,null,null,null,null,null,null,null,null,null,null,null,null,null,null,null,{"$f":"IF(SUM(O12,Q12,T12:U12,Y12)=0,\"\",SUM(O12,Q12,T12:U12,Y12))","v":""},null,{"$f":"IF(ISERROR(VLOOKUP(J12,Paramètres!$A$13:$B$22,2,FALSE)),\"\",VLOOKUP(J12,Paramètres!$A$13:$B$22,2,FALSE)*K12)","v":""},{"$f":"IF(ISERROR(VLOOKUP(L12,Paramètres!$C$13:$D$22,2,FALSE)),\"\",VLOOKUP(L12,Paramètres!$C$13:$D$22,2,FALSE)*M12)","v":""},{"$f":"IF(N12<>\"\",IF((SUM($R$7,$N$12:N12)-N12)>2000,0,IF(AND(SUM($R$7,$N$12:N12)-N12=0,N12<=2000),N12,IF(SUM($R$7,$N$12)<2000,N12,2000-(SUM($R$7,$N$12:N12)-N12)))),\"\")","v":""},{"$f":"IF(N12<>\"\",IF((SUM($R$7,$N$12:N12)-N12)>10000,0,IF(SUM($R$7,$N$12:N12)<=2000,0,IF(SUM($R$7,$N$12:N12)>10000,10000-SUM($V$12:V12),SUM($N$12:N12)-SUM($V$12:V12)))),\"\")","v":""},{"$f":"IF(N12<>\"\",IF(SUM($N$12:N12)-SUM($V$12:W12)=0,0,SUM($N$12:N12)-SUM($V$12:W12)),\"\")","v":""},{"$f":"IF(ISERROR(SUM(V12*$M$6,W12*$O$6,X12*$Q$6)),\"\",SUM(V12*$M$6,W12*$O$6,X12*$Q$6))","v":""}]
[null,null,null,null,null,null,null,null,null,null,null,null,null,null,null,null,null,{"$f":"IF(SUM(O13,Q13,T13:U13,Y13)=0,\"\",SUM(O13,Q13,T13:U13,Y13))","v":""},null,{"$f":"IF(ISERROR(VLOOKUP(J13,Paramètres!$A$13:$B$22,2,FALSE)),\"\",VLOOKUP(J13,Paramètres!$A$13:$B$22,2,FALSE)*K13)","v":""},{"$f":"IF(ISERROR(VLOOKUP(L13,Paramètres!$C$13:$D$22,2,FALSE)),\"\",VLOOKUP(L13,Paramètres!$C$13:$D$22,2,FALSE)*M13)","v":""},{"$f":"IF(N13<>\"\",IF((SUM($R$7,$N$12:N13)-N13)>2000,0,IF(SUM($R$7,$N$12:N13)-N13=0,N13,IF(SUM($R$7,$N$12:N13)<2000,N13,2000-(SUM($R$7,$N$12:N13)-N13)))),\"\")","v":""},{"$f":"IF(N13<>\"\",IF((SUM($R$7,$N$12:N13)-N13)>10000,0,IF(SUM($R$7,$N$12:N13)<=2000,0,IF(SUM($R$7,$N$12:N13)>10000,10000-SUM($R$7,$V$12:V13,$W$12:W12),SUM($N$12:N13)-SUM($V$12:V13,$W$12:W12)))),\"\")","v":""},{"$f":"IF(N13<>\"\",IF(SUM($N$12:N13)-SUM($V$12:W13,$X$12:X12)=0,0,SUM($N$12:N13)-SUM($V$12:W13,$X$12:X12)),\"\")","v":""},{"$f":"IF(ISERROR(SUM(V13*$M$6,W13*$O$6,X13*$Q$6)),\"\",SUM(V13*$M$6,W13*$O$6,X13*$Q$6))","v":""}]
[null,null,null,null,null,null,null,null,null,null,null,null,null,null,null,null,null,"",null,{"$f":"IF(ISERROR(VLOOKUP(J14,Paramètres!$A$13:$B$22,2,FALSE)),\"\",VLOOKUP(J14,Paramètres!$A$13:$B$22,2,FALSE)*K14)","v":""},{"$f":"IF(ISERROR(VLOOKUP(L14,Paramètres!$C$13:$D$22,2,FALSE)),\"\",VLOOKUP(L14,Paramètres!$C$13:$D$22,2,FALSE)*M14)","v":""},{"$f":"IF(N14<>\"\",IF((SUM($R$7,$N$12:N14)-N14)>2000,0,IF(SUM($R$7,$N$12:N14)-N14=0,N14,IF(SUM($R$7,$N$12:N14)<2000,N14,2000-(SUM($R$7,$N$12:N14)-N14)))),\"\")","v":""},{"$f":"IF(N14<>\"\",IF((SUM($R$7,$N$12:N14)-N14)>10000,0,IF(SUM($R$7,$N$12:N14)<=2000,0,IF(SUM($R$7,$N$12:N14)>10000,10000-SUM($R$7,$V$12:V14,$W$12:W13),SUM($N$12:N14)-SUM($V$12:V14,$W$12:W13)))),\"\")","v":""},{"$f":"IF(N14<>\"\",IF(SUM($N$12:N14)-SUM($V$12:W14,$X$12:X13)=0,0,SUM($N$12:N14)-SUM($V$12:W14,$X$12:X13)),\"\")","v":""},""]
[null,null,null,null,null,null,null,null,null,null,null,null,null,null,null,null,null,"",null,{"$f":"IF(ISERROR(VLOOKUP(J15,Paramètres!$A$13:$B$22,2,FALSE)),\"\",VLOOKUP(J15,Paramètres!$A$13:$B$22,2,FALSE)*K15)","v":""},{"$f":"IF(ISERROR(VLOOKUP(L15,Paramètres!$C$13:$D$22,2,FALSE)),\"\",VLOOKUP(L15,Paramètres!$C$13:$D$22,2,FALSE)*M15)","v":""},{"$f":"IF(N15<>\"\",IF((SUM($R$7,$N$12:N15)-N15)>2000,0,IF(SUM($R$7,$N$12:N15)-N15=0,N15,IF(SUM($R$7,$N$12:N15)<2000,N15,2000-(SUM($R$7,$N$12:N15)-N15)))),\"\")","v":""},{"$f":"IF(N15<>\"\",IF((SUM($R$7,$N$12:N15)-N15)>10000,0,IF(SUM($R$7,$N$12:N15)<=2000,0,IF(SUM($R$7,$N$12:N15)>10000,10000-SUM($R$7,$V$12:V15,$W$12:W14),SUM($N$12:N15)-SUM($V$12:V15,$W$12:W14)))),\"\")","v":""},{"$f":"IF(N15<>\"\",IF(SUM($N$12:N15)-SUM($V$12:W15,$X$12:X14)=0,0,SUM($N$12:N15)-SUM($V$12:W15,$X$12:X14)),\"\")","v":""},""]
{"$rows_left_out":27}
{"sheet":"Frais de déplacement","index":2,"n_rows":1,"n_cols":1,"rows_kept":1,"cut":false,"hidden":true,"merged":[]}
["Formulaire d'état de frais de déplacement :\n- Merci d'activer les macros en cliquant sur le bouton ci-dessus \"Activer le contenu\"."]

{"sheet":"Paramètres","index":3,"n_rows":196,"n_cols":27,"rows_kept":196,"cut":false,"hidden":true,"merged":[[1,14,6,14],[7,7,12,7],[0,10,0,11],[10,0,10,1],[10,2,10,3],[0,5,0,6],[1,7,6,7],[0,7,0,9]]}
["DT/DR","DT","Intitulé :","Méditerranée",null,"DOF utilisés pour les frais de déplacement (réF. MET_Définitions analytiques_2021)",null,"DOF à inclure dans la liste déroulante de saisie",null,null,"DOF inclus dans la liste déroulante de saisie",null,"NB","Alpha",null,"DT Auvergne-Rhône-Alpes","DT Bourgogne-Franche-Comté","DT Centre-Ouest-Aquitaine","DT Grand-Est","DT Midi-Méditerranée","DT Seine-Nord","DT Corse","DT Guyane","DT Martinique","DR Guadeloupe","DR La Réunion","Direction générale"]
[null,null,null,null,null,"1-FD99-GEFO","Gestion foncière","Indiquer dans cette zone les 8  domaines à proposer è","Z-FA49-AMDO","Autre étude et expertise",{"$f":"CONCATENATE(I2,\"/\",J2)","v":"Z-FA49-AMDO/Autre étude et expertise"},null,0,"zéro","Modification 2021 : Indiquer dans ces colonnes, les   domaines à proposer par DT è","1-FF99-SORE/Recherche & développement national","1-FA49-AMDO/Autre étude et expertise","1-FA49-AMDO/Autre étude et expertise","1-FA49-AMDO/Autre étude et expertise","1-FA49-AMDO/Autre étude et expertise","1-FA49-AMDO/Autre étude et expertise","1-FA49-AMDO/Autre étude et expertise","1-FA49-AMDO/Autre étude et expertise","1-FA49-AMDO/Autre étude et expertise","1-FA49-AMDO/Autre étude et expertise","1-FA49-AMDO/Autre étude et expertise","1-FA49-AMDO/Autre étude et expertise"]
[null,null,null,null,null,"1-FD99-GESU","Surveillance",null,"1-FD99-BOMA",{"$f":"VLOOKUP(I:I,F:G,2,FALSE)","v":"Martelage"},{"$f":"CONCATENATE(I3,\"/\",J3)","v":"1-FD99-BOMA/Martelage"},null,1,"un",null,"1-FF99-SORZ/Réseaux naturalistes nationaux","1-FD99-BOMA/Martelage","1-FD99-BOMA/Martelage","1-FD99-BOMA/Martelage","1-FD99-BOMA/Martelage","1-FD99-BOMA/Martelage","1-FD99-BOMA/Martelage","1-FD99-BOMA/Martelage","1-FD99-BOMA/Martelage","1-FD99-BOMA/Martelage","1-FD99-BOMA/Martelage","1-FD99-BOMA/Martelage"]
["Barème kilométrique à préciser","jusqu'à 2000 km","de 2001 à 10000 km","au delà de 10000 km",null,"1-FD99-GEPC","Chasse et pêche",null,"1-FF99-GESU","Surveillance","1-FF99-GESU/Surveillance",null,2,"deux",null,"2-CN60-ENDV/MIG Biodiversité","1-FF99-GESU/Surveillance","1-FF99-GESU/Surveillance","1-FF99-GESU/Surveillance","1-FF99-GESU/Surveillance","1-FF99-GESU/Surveillance","1-FF99-GESU/Surveillance","1-FF99-GESU/Surveillance","1-FF99-GESU/Surveillance","1-FF99-GESU/Surveillance","1-FF99-GESU/Surveillance","1-FF99-GESU/Surveillance"]
["PEF Voiture 5 CV et -",0.28999999999999998,0.36,0.21,null,"1-FD99-GECH","Licences dirigées chasse & pêche",null,"1-FF99-PNRN","RENECOFOR",{"$f":"CONCATENATE(I5,\"/\",J5)","v":"1-FF99-PNRN/RENECOFOR"},null,3,"trois",null,"8-SO10-FOTP/Formation tous personnels","2-CN20-INPA/Patrouilles incendie national","2-CN20-INPA/Patrouilles incendie national","2-CN20-INPA/Patrouilles incendie national","2-CN20-INPA/Patrouilles incendie national","2-CN20-INPA/Patrouilles incendie national","2-CN20-INPA/Patrouilles incendie national","2-CN20-INPA/Patrouilles incendie national","2-CN20-INPA/Patrouilles incendie national","2-CN20-INPA/Patrouilles incendie national","2-CN20-INPA/Patrouilles incendie national","2-CN20-INPA/Patrouilles incendie national"]
["PEF Voiture 6 et 7 CV",0.37,0.46,0.27,null,"1-FD99-GESA","Suivi de la mise en œuvre des aménagements et bilans de gestion ",null,"1-FF99-SORZ","Réseaux naturalistes nationaux","1-FF99-SORZ/Réseaux naturalistes nationaux",null,4,"quatre",null,"8-SO10-SYTP/Représentation tous personnels","2-CN30-LNDU/Gestion des dunes (agriculture)","2-CN30-LNDU/Gestion des dunes (agriculture)","2-CN30-LNDU/Gestion des dunes (agriculture)","2-CN30-LNDU/Gestion des dunes (agriculture)","2-CN30-LNDU/Gestion des dunes (agriculture)","2-CN30-LNDU/Gestion des dunes (agriculture)","2-CN30-LNDU/Gestion des dunes (agriculture)","2-CN30-LNDU/Gestion des dunes (agriculture)","2-CN30-LNDU/Gestion des dunes (agriculture)","2-CN30-LNDU/Gestion des dunes (agriculture)","2-CN30-LNDU/Gestion des dunes (agriculture)"]
["PEF Voiture 8 CV et +",0.41,0.5,0.28999999999999998,null,"1-FD99-AMDO","Autre étude et expertise",null,"2-CN20-INPA","Patrouilles incendie national","2-CN20-INPA/Patrouilles incendie national",null,5,"cinq",null,"8-SO30-STRA/Stratégie","2-CN40-ZDOM/MIG DOM","2-CN40-ZDOM/MIG DOM","2-CN40-ZDOM/MIG DOM","2-CN40-ZDOM/MIG DOM","2-CN40-ZDOM/MIG DOM","2-CN40-ZDOM/MIG DOM","2-CN40-ZDOM/MIG DOM","2-CN40-ZDOM/MIG DOM","2-CN40-ZDOM/MIG DOM","2-CN40-ZDOM/MIG DOM","2-CN40-ZDOM/MIG DOM"]
["CCN Indemnité petit déplacement",0.37,0.37,0.37,null,"1-FD99-BOMA","Martelage","Les trois colonnes suivantes ne sont plus utiles ( à maintenir pour la cohérence de l'ensemble) è","2-CN30-LNDU","Gestion des dunes (agriculture)","2-CN30-LNDU/Gestion des dunes (agriculture)",null,6,"six",null,"8-SO30-CMUN/Communication","2-CN60-ELAU/Autres MIG locales environnementales","2-CN60-ELAU/Autres MIG locales environnementales","2-CN60-ELAU/Autres MIG locales environnementales","2-CN60-ELAU/Autres MIG locales environnementales","2-CN60-ELAU/Autres MIG locales environnementales","2-CN60-ELAU/Autres MIG locales environnementales","2-CN60-ELAU/Autres MIG locales environnementales","2-CN60-ELAU/Autres MIG locales environnementales","2-CN60-ELAU/Autres MIG locales environnementales","2-CN60-ELAU/Autres MIG locales environnementales","2-CN60-ELAU/Autres MIG locales environnementales"]
["CCN Indemnité de covoiturage",{"$f":"B8*1.5","v":0.55499999999999994},{"$f":"C8*1.5","v":0.55499999999999994},0.55499999999999994,null,"1-FD99-BOCO","Commercialisation et mise en vente des bois",null,"2-CN40-ZDOM","MIG DOM","2-CN40-ZDOM/MIG DOM",null,7,"sept",null,"8-SO30-FICO/Finance - comptabilité","2-CN60-ENDV/MIG Biodiversité","2-CN60-ENDV/MIG Biodiversité","2-CN60-ENDV/MIG Biodiversité","2-CN60-ENDV/MIG Biodiversité","2-CN60-ENDV/MIG Biodiversité","2-CN60-ENDV/MIG Biodiversité","2-CN60-ENDV/MIG Biodiversité","2-CN60-ENDV/MIG Biodiversité","2-CN60-ENDV/MIG Biodiversité","2-CN60-ENDV/MIG Biodiversité","2-CN60-ENDV/MIG Biodiversité"]
[null,null,null,null,null,"1-FD99-BOSC","Suivi des coupes",null,"2-CN60-ELAU","Autres MIG locales environnementales","2-CN60-ELAU/Autres MIG locales environnementales",null,8,"huit",null,"8-SO20-IMSG/Immobilier - services généraux","3-CL99-SEAS/Assistance technique","3-CL99-SEAS/Assistance technique","3-CL99-SEAS/Assistance technique","3-CL99-SEAS/Assistance technique","3-CL99-SEAS/Assistance technique","3-CL99-SEAS/Assistance technique","3-CL99-SEAS/Assistance technique","3-CL99-SEAS/Assistance technique","3-CL99-SEAS/Assistance technique","3-CL99-SEAS/Assistance technique","3-CL99-SEAS/Assistance technique"]
["Taux de repas à préciser",null,"Taux de nuitées à préciser",null,null,"1-FD99-EXBO","Exploitation des bois",null,"2-CN60-ENDV","MIG Biodiversité","2-CN60-ENDV/MIG Biodiversité",null,9,"neuf",null,"8-SO20-AGSI/Système d'information","3-CZ99-SODE/Soutien activités concurrentielles","3-CZ99-SODE/Soutien activités concurrentielles","3-CZ99-SODE/Soutien activités concurrentielles","3-CZ99-SODE/Soutien activités concurrentielles","3-CZ99-SODE/Soutien activités concurrentielles","3-CZ99-SODE/Soutien activités concurrentielles","3-CZ99-SODE/Soutien activités concurrentielles","3-CZ99-SODE/Soutien activités concurrentielles","3-CZ99-SODE/Soutien activités concurrentielles","3-CZ99-SODE/Soutien activités concurrentielles","3-CZ99-SODE/Soutien activités concurrentielles"]
["Libellé","Taux","Libellé","Taux",null,"1-FD99-EXTP","Transport des bois",null,"2-CN70-PNSA","MIG Santé des forêts / Direction générale","2-CN70-PNSA/MIG Santé des forêts / Direction générale",null,10,"dix",null,"8-SO10-REHU/Ressources humaines","8-SO10-FOTP/Formation tous personnels","8-SO10-FOTP/Formation tous personnels","8-SO10-FOTP/Formation tous personnels","8-SO10-FOTP/Formation tous personnels","8-SO10-FOTP/Formation tous personnels","8-SO10-FOTP/Formation tous personnels","8-SO10-FOTP/Formation tous personnels","8-SO10-FOTP/Formation tous personnels","8-SO10-FOTP/Formation tous personnels","8-SO10-FOTP/Formation tous personnels","8-SO10-FOTP/Formation tous personnels"]
["Tournée PEF 14,00 €",14,"PEF : Paris 110 €",110,null,"1-FD99-TRRE","Travaux de régénération",null,"3-CL99-SEAS","Assistance technique",{"$f":"CONCATENATE(I13,\"/\",J13)","v":"3-CL99-SEAS/Assistance technique"},null,11,"onze",null,"Z-OUT9-PEFA/Personnels fonctionnaires & assimilés","8-SO10-SYTP/Représentation tous personnels","8-SO10-SYTP/Représentation tous personnels","8-SO10-SYTP/Représentation tous personnels","8-SO10-SYTP/Représentation tous personnels","8-SO10-SYTP/Représentation tous personnels","8-SO10-SYTP/Représentation tous personnels","8-SO10-SYTP/Représentation tous personnels","8-SO10-SYTP/Représentation tous personnels","8-SO10-SYTP/Représentation tous personnels","8-SO10-SYTP/Représentation tous personnels","8-SO10-SYTP/Représentation tous personnels"]
["Mission PEF 17,50 €",17.5,"PEF : communes > 200 000 hab 90 €",90,null,"1-FD99-TRPE","Autres travaux sur peuplement",null,"3-CZ99-SODE","Soutien activités concurrentielles","3-CZ99-SODE/Soutien activités concurrentielles",null,12,"douze",null,null,"8-SO30-STRA/Stratégie","8-SO30-STRA/Stratégie","8-SO30-STRA/Stratégie","8-SO30-STRA/Stratégie","8-SO30-STRA/Stratégie","8-SO30-STRA/Stratégie","8-SO30-STRA/Stratégie","8-SO30-STRA/Stratégie","8-SO30-STRA/Stratégie","8-SO30-STRA/Stratégie","8-SO30-STRA/Stratégie"]
[null,null,"PEF : autres communes 70 €",70,null,"1-FD99-TRIC","Travaux de création infrastructure",null,"8-SO10-FOTP","Formation tous personnels","8-SO10-FOTP/Formation tous personnels",null,13,"treize",null,null,"8-SO30-CMUN/Communication","8-SO30-CMUN/Communication","8-SO30-CMUN/Communication","8-SO30-CMUN/Communication","8-SO30-CMUN/Communication","8-SO30-CMUN/Communication","8-SO30-CMUN/Communication","8-SO30-CMUN/Communication","8-SO30-CMUN/Communication","8-SO30-CMUN/Communication","8-SO30-CMUN/Communication"]
{"$rows_left_out":181}